Target
Carbonic anhydrase 1
Ligand
BDBM50130030
Substrate
Meas. Tech.
ChEMBL_1524260 (CHEMBL3631736)
Ki
29620±n/a nM
Citation
 Fidan, ISalmas, REArslan, MSentürk, MDurdagi, SEkinci, DSentürk, ECosgun, SSupuran, CT Carbonic anhydrase inhibitors: Design, synthesis, kinetic, docking and molecular dynamics analysis of novel glycine and phenylalanine sulfonamide derivatives. Bioorg Med Chem 23:7353-8 (2015)  
Target
Name:
Carbonic anhydrase 1
Synonyms:
CA-I CAB Carbonate dehydratase I Carbonic anhydrase 1 (CA I) Carbonic anhydrase 1 (Recombinant CA I) Carbonic anhydrase B Carbonic anhydrase I (CA I) Carbonic anhydrase I (CAI) Carbonic anhydrase isoenzyme I (hCA I) | hCA
Type:
Enzyme
Mol. Mass.:
28873.37
Organism:
Homo sapiens (Human)
Description:
P00915
Residue:
261
  
Inhibitor
Name:
BDBM50130030
Synonyms:
CHEMBL1885780
Type:
Small organic molecule
Emp. Form.:
C16H17NO4S
Mol. Mass.:
319.375
SMILES:
Cc1ccc(cc1)S(=O)(=O)NCC(=O)OCc1ccccc1
: