Target
Cytochrome P450 2D6
Ligand
BDBM50377937
Substrate
Meas. Tech.
ChEMBL_1525142 (CHEMBL3635480)
Ki
78±n/a nM
Citation
 van Breemen, RB Development of Safe and Effective Botanical Dietary Supplements. J Med Chem 58:8360-72 (2015)  
Target
Name:
Cytochrome P450 2D6
Synonyms:
CP2D6_HUMAN CYP2DL1 Cytochrome P450 2D6 (CYP2D6) P450-DB1
Type:
Protein
Mol. Mass.:
55774.82
Organism:
Homo sapiens (Human)
Description:
P10635
Residue:
497
  
Inhibitor
Name:
BDBM50377937
Synonyms:
PROTOPINE
Type:
Small organic molecule
Emp. Form.:
C20H19NO5
Mol. Mass.:
353.3686
SMILES:
CN1CCc2cc3OCOc3cc2C(=O)Cc2cc3OCOc3cc2C1
: