Target
Cytochrome P450 2C9
Ligand
BDBM50090677
Substrate
Meas. Tech.
ChEMBL_1525505 (CHEMBL3636858)
IC50
80±n/a nM
Citation
 Elkamhawy, AViswanath, ANPae, ANKim, HYHeo, JCPark, WKLee, COYang, HKim, KHNam, DHSeol, HJCho, HRoh, EJ Discovery of potent and selective cytotoxic activity of new quinazoline-ureas against TMZ-resistant glioblastoma multiforme (GBM). Eur J Med Chem 103:210-22 (2015)  
Target
Name:
Cytochrome P450 2C9
Synonyms:
(R)-limonene 6-monooxygenase CP2C9_HUMAN CYP2C9 Cytochrome P450 2C9 (CYP2C9 ) P-450MP P450 PB-1 | S-mephenytoin 4-hydroxylase
Type:
Enzyme
Mol. Mass.:
55636.33
Organism:
Homo sapiens (Human)
Description:
P11712
Residue:
490
  
Inhibitor
Name:
BDBM50090677
Synonyms:
4-Amino-N-(2-phenyl-2H-pyrazol-3-yl)-benzenesulfonamide CHEMBL1109 Sulfabid US9180183, Sulfaphenazole
Type:
Small organic molecule
Emp. Form.:
C15H14N4O2S
Mol. Mass.:
314.362
SMILES:
Nc1ccc(cc1)S(=O)(=O)Nc1ccnn1-c1ccccc1
: