Target
5-hydroxytryptamine receptor 1E
Ligand
BDBM50132341
Substrate
Meas. Tech.
ChEMBL_1527269 (CHEMBL3636148)
Ki
>900±n/a nM
Citation
 Ponnala, SKapadia, NMadapa, SAlberts, ILHarding, WW Synthesis and evaluation of aporphine analogs containing C1 allyl isosteres at the h5-HT(2A) receptor. Bioorg Med Chem Lett 25:5102-6 (2015)  
Target
Name:
5-hydroxytryptamine receptor 1E
Synonyms:
5-HT-1E 5-Hydroxytryptamine Receptor Subtype 1E (5HT1E) 5-hydroxytryptamine receptor 1E (5-HT-1E) (S31) 5HT1E_HUMAN S31 Serotonin 1e (5-HT1e) receptor | Serotonin Receptor 1E
Type:
G Protein-Coupled Receptor (GPCR)
Mol. Mass.:
41697.80
Organism:
Homo sapiens (Human)
Description:
gi_112822
Residue:
365
  
Inhibitor
Name:
BDBM50132341
Synonyms:
CHEMBL3633757
Type:
Small organic molecule
Emp. Form.:
C26H24BrNO4
Mol. Mass.:
494.377
SMILES:
COc1cc2CCN(C)C3Cc4cc5OCOc5cc4-c(c1OCc1ccc(Br)cc1)c23
: