Target
D(3) dopamine receptor
Ligand
BDBM50132341
Substrate
Meas. Tech.
ChEMBL_1527276 (CHEMBL3636155)
Ki
>900±n/a nM
Citation
 Ponnala, SKapadia, NMadapa, SAlberts, ILHarding, WW Synthesis and evaluation of aporphine analogs containing C1 allyl isosteres at the h5-HT(2A) receptor. Bioorg Med Chem Lett 25:5102-6 (2015)  
Target
Name:
D(3) dopamine receptor
Synonyms:
DOPAMINE D3 DRD3_HUMAN Dopamine D3 receptor (D3) Dopamine receptor Dopamine receptor D3
Type:
Mol. Mass.:
44243.43
Organism:
Homo sapiens (Human)
Description:
Residue:
400
  
Inhibitor
Name:
BDBM50132341
Synonyms:
CHEMBL3633757
Type:
Small organic molecule
Emp. Form.:
C26H24BrNO4
Mol. Mass.:
494.377
SMILES:
COc1cc2CCN(C)C3Cc4cc5OCOc5cc4-c(c1OCc1ccc(Br)cc1)c23
: