Target
Cytochrome P450 2D6
Ligand
BDBM50132507
Substrate
Meas. Tech.
ChEMBL_1527453 (CHEMBL3636984)
IC50
>30000±n/a nM
Citation
 Malosh, CTurlington, MBridges, TMRook, JMNoetzel, MJVinson, PNSteckler, TLavreysen, HMackie, CBartolomé-Nebreda, JMConde-Ceide, SMartínez-Viturro, CMPiedrafita, MSánchez-Casado, MRMacdonald, GJDaniels, JSJones, CKNiswender, CMConn, PJLindsley, CWStauffer, SR Acyl dihydropyrazolo[1,5-a]pyrimidinones as metabotropic glutamate receptor 5 positive allosteric modulators. Bioorg Med Chem Lett 25:5115-20 (2015)  
Target
Name:
Cytochrome P450 2D6
Synonyms:
CP2D6_HUMAN CYP2DL1 Cytochrome P450 2D6 (CYP2D6) P450-DB1
Type:
Protein
Mol. Mass.:
55774.82
Organism:
Homo sapiens (Human)
Description:
P10635
Residue:
497
  
Inhibitor
Name:
BDBM50132507
Synonyms:
CHEMBL3633943
Type:
Small organic molecule
Emp. Form.:
C15H17N3O2
Mol. Mass.:
271.3144
SMILES:
CC(=O)N1CCCn2nc(COc3ccccc3)cc12
: