Target
Metabotropic glutamate receptor 4
Ligand
BDBM50132507
Substrate
Meas. Tech.
ChEMBL_1524894 (CHEMBL3637024)
EC50
>10000±n/a nM
Citation
 Malosh, CTurlington, MBridges, TMRook, JMNoetzel, MJVinson, PNSteckler, TLavreysen, HMackie, CBartolomé-Nebreda, JMConde-Ceide, SMartínez-Viturro, CMPiedrafita, MSánchez-Casado, MRMacdonald, GJDaniels, JSJones, CKNiswender, CMConn, PJLindsley, CWStauffer, SR Acyl dihydropyrazolo[1,5-a]pyrimidinones as metabotropic glutamate receptor 5 positive allosteric modulators. Bioorg Med Chem Lett 25:5115-20 (2015)  
Target
Name:
Metabotropic glutamate receptor 4
Synonyms:
GPRC1D GRM4_HUMAN MGLUR4 Metabotropic glutamate receptor 4 (mGlu4) metabotropic glutamate 4
Type:
Protein
Mol. Mass.:
101899.95
Organism:
Homo sapiens (Human)
Description:
Q14833
Residue:
912
  
Inhibitor
Name:
BDBM50132507
Synonyms:
CHEMBL3633943
Type:
Small organic molecule
Emp. Form.:
C15H17N3O2
Mol. Mass.:
271.3144
SMILES:
CC(=O)N1CCCn2nc(COc3ccccc3)cc12
: