Target
Metabotropic glutamate receptor 5
Ligand
BDBM50132545
Substrate
Meas. Tech.
ChEMBL_1527423 (CHEMBL3636798)
EC50
700±n/a nM
Citation
 Malosh, CTurlington, MBridges, TMRook, JMNoetzel, MJVinson, PNSteckler, TLavreysen, HMackie, CBartolomé-Nebreda, JMConde-Ceide, SMartínez-Viturro, CMPiedrafita, MSánchez-Casado, MRMacdonald, GJDaniels, JSJones, CKNiswender, CMConn, PJLindsley, CWStauffer, SR Acyl dihydropyrazolo[1,5-a]pyrimidinones as metabotropic glutamate receptor 5 positive allosteric modulators. Bioorg Med Chem Lett 25:5115-20 (2015)  
Target
Name:
Metabotropic glutamate receptor 5
Synonyms:
GPRC1E GRM5_HUMAN metabotropic glutamate 5 | metabotropic glutamate 5a
Type:
Enzyme
Mol. Mass.:
132484.72
Organism:
Homo sapiens (Human)
Description:
Residue:
1212
  
Inhibitor
Name:
BDBM50132545
Synonyms:
CHEMBL3633972
Type:
Small organic molecule
Emp. Form.:
C16H20N4O
Mol. Mass.:
284.3562
SMILES:
CN(Cc1cc2N(CCCn2n1)C(C)=O)c1ccccc1
: