Target
Metabotropic glutamate receptor 5
Ligand
BDBM50132555
Substrate
Meas. Tech.
ChEMBL_1527423 (CHEMBL3636798)
EC50
257±n/a nM
Citation
 Malosh, CTurlington, MBridges, TMRook, JMNoetzel, MJVinson, PNSteckler, TLavreysen, HMackie, CBartolomé-Nebreda, JMConde-Ceide, SMartínez-Viturro, CMPiedrafita, MSánchez-Casado, MRMacdonald, GJDaniels, JSJones, CKNiswender, CMConn, PJLindsley, CWStauffer, SR Acyl dihydropyrazolo[1,5-a]pyrimidinones as metabotropic glutamate receptor 5 positive allosteric modulators. Bioorg Med Chem Lett 25:5115-20 (2015)  
Target
Name:
Metabotropic glutamate receptor 5
Synonyms:
GPRC1E GRM5_HUMAN metabotropic glutamate 5 | metabotropic glutamate 5a
Type:
Enzyme
Mol. Mass.:
132484.72
Organism:
Homo sapiens (Human)
Description:
Residue:
1212
  
Inhibitor
Name:
BDBM50132555
Synonyms:
CHEMBL3633960
Type:
Small organic molecule
Emp. Form.:
C17H16N4O2S
Mol. Mass.:
340.4
SMILES:
O=C(N1CCCn2nc(COc3ccccc3)cc12)c1nccs1
: