Target
Kappa-type opioid receptor
Ligand
BDBM50133220
Substrate
Meas. Tech.
ChEMBL_1525468 (CHEMBL3636666)
Ki
44±n/a nM
Citation
 Joshi, AAMurray, TFAldrich, JV Structure-Activity Relationships of the Peptide Kappa Opioid Receptor Antagonist Zyklophin. J Med Chem 58:8783-95 (2015)  
Target
Name:
Kappa-type opioid receptor
Synonyms:
KOR-1 OPIATE Kappa Opioid receptor Ror-d
Type:
G Protein-Coupled Receptor (GPCR)
Mol. Mass.:
42692.90
Organism:
Rattus norvegicus (rat)
Description:
P34975
Residue:
380
  
Inhibitor
Name:
BDBM50133220
Synonyms:
CHEMBL3634920
Type:
Small organic molecule
Emp. Form.:
C62H97N23O13
Mol. Mass.:
1372.5799
SMILES:
NCCCC[C@H](NC(=O)[C@@H]1CCCN1C(=O)[C@H](CCCNC(N)=N)NC(=O)C1CNC(=O)C[C@@H](NC(=O)[C@H](Cc2ccccc2)NC(=O)CNC(=O)CNC(=O)[C@H](Cc2ccc(O)cc2)NCC2CC2)C(=O)N[C@@H](CCCNC(N)=N)C(=O)N[C@@H](CCCNC(N)=N)C(=O)N1)C(N)=O
: