Target
Acetylcholinesterase
Ligand
BDBM50133414
Substrate
Meas. Tech.
ChEMBL_1525953 (CHEMBL3635777)
IC50
6610±n/a nM
Citation
 Nepovimova, EKorabecny, JDolezal, RBabkova, KOndrejicek, AJun, DSepsova, VHorova, AHrabinova, MSoukup, OBukum, NJost, PMuckova, LKassa, JMalinak, DAndrs, MKuca, K Tacrine-Trolox Hybrids: A Novel Class of Centrally Active, Nonhepatotoxic Multi-Target-Directed Ligands Exerting Anticholinesterase and Antioxidant Activities with Low In Vivo Toxicity. J Med Chem 58:8985-9003 (2015)  
Target
Name:
Acetylcholinesterase
Synonyms:
ACES_HUMAN Acetylcholinesterase (AChE) | Acetylcholinesterase (human AChE)
Type:
Enzyme
Mol. Mass.:
67792.70
Organism:
Homo sapiens (Human)
Description:
P22303
Residue:
614
  
Inhibitor
Name:
BDBM50133414
Synonyms:
CHEMBL3632849
Type:
Small organic molecule
Emp. Form.:
C34H45N3O4
Mol. Mass.:
559.7388
SMILES:
COc1ccc2nc3CCCCc3c(NCCCCCCNC(=O)C3(C)CCc4c(C)c(O)c(C)c(C)c4O3)c2c1
: