Target
Acetylcholinesterase
Ligand
BDBM50133473
Substrate
Meas. Tech.
ChEMBL_1525953 (CHEMBL3635777)
IC50
80±n/a nM
Citation
 Nepovimova, EKorabecny, JDolezal, RBabkova, KOndrejicek, AJun, DSepsova, VHorova, AHrabinova, MSoukup, OBukum, NJost, PMuckova, LKassa, JMalinak, DAndrs, MKuca, K Tacrine-Trolox Hybrids: A Novel Class of Centrally Active, Nonhepatotoxic Multi-Target-Directed Ligands Exerting Anticholinesterase and Antioxidant Activities with Low In Vivo Toxicity. J Med Chem 58:8985-9003 (2015)  
Target
Name:
Acetylcholinesterase
Synonyms:
ACES_HUMAN Acetylcholinesterase (AChE) | Acetylcholinesterase (human AChE)
Type:
Enzyme
Mol. Mass.:
67792.70
Organism:
Homo sapiens (Human)
Description:
P22303
Residue:
614
  
Inhibitor
Name:
BDBM50133473
Synonyms:
CHEMBL3632994
Type:
Small organic molecule
Emp. Form.:
C35H46ClN3O3
Mol. Mass.:
592.211
SMILES:
Cc1c(C)c2OC(C)(CCc2c(C)c1O)C(=O)NCCCCCCCCNc1c2CCCCc2nc2cc(Cl)ccc12
: