Target
Cholinesterase
Ligand
BDBM50133416
Substrate
Meas. Tech.
ChEMBL_1525952 (CHEMBL3635776)
IC50
1530±n/a nM
Citation
 Nepovimova, EKorabecny, JDolezal, RBabkova, KOndrejicek, AJun, DSepsova, VHorova, AHrabinova, MSoukup, OBukum, NJost, PMuckova, LKassa, JMalinak, DAndrs, MKuca, K Tacrine-Trolox Hybrids: A Novel Class of Centrally Active, Nonhepatotoxic Multi-Target-Directed Ligands Exerting Anticholinesterase and Antioxidant Activities with Low In Vivo Toxicity. J Med Chem 58:8985-9003 (2015)  
Target
Name:
Cholinesterase
Synonyms:
Acylcholine acylhydrolase Butyrylcholine esterase (BChE) Butyrylcholinesterase (BuChE) CHLE_HUMAN Cholinesterases Pseudocholinesterase
Type:
Homotetramer
Mol. Mass.:
68422.27
Organism:
Homo sapiens (Human)
Description:
P06276
Residue:
602
  
Inhibitor
Name:
BDBM50133416
Synonyms:
CHEMBL3632851
Type:
Small organic molecule
Emp. Form.:
C36H49N3O4
Mol. Mass.:
587.792
SMILES:
COc1ccc2nc3CCCCc3c(NCCCCCCCCNC(=O)C3(C)CCc4c(C)c(O)c(C)c(C)c4O3)c2c1
: