Target
Cholinesterase
Ligand
BDBM50133469
Substrate
Meas. Tech.
ChEMBL_1525952 (CHEMBL3635776)
IC50
90±n/a nM
Citation
 Nepovimova, EKorabecny, JDolezal, RBabkova, KOndrejicek, AJun, DSepsova, VHorova, AHrabinova, MSoukup, OBukum, NJost, PMuckova, LKassa, JMalinak, DAndrs, MKuca, K Tacrine-Trolox Hybrids: A Novel Class of Centrally Active, Nonhepatotoxic Multi-Target-Directed Ligands Exerting Anticholinesterase and Antioxidant Activities with Low In Vivo Toxicity. J Med Chem 58:8985-9003 (2015)  
Target
Name:
Cholinesterase
Synonyms:
Acylcholine acylhydrolase Butyrylcholine esterase (BChE) Butyrylcholinesterase (BuChE) CHLE_HUMAN Cholinesterases Pseudocholinesterase
Type:
Homotetramer
Mol. Mass.:
68422.27
Organism:
Homo sapiens (Human)
Description:
P06276
Residue:
602
  
Inhibitor
Name:
BDBM50133469
Synonyms:
CHEMBL3632990
Type:
Small organic molecule
Emp. Form.:
C31H38ClN3O3
Mol. Mass.:
536.105
SMILES:
Cc1c(C)c2OC(C)(CCc2c(C)c1O)C(=O)NCCCCNc1c2CCCCc2nc2cc(Cl)ccc12
: