Target
Carbonic anhydrase
Ligand
BDBM50028010
Substrate
Meas. Tech.
ChEMBL_1543853 (CHEMBL3749743)
Ki
140±n/a nM
Citation
 Vullo, DBhatt, AMahon, BPMcKenna, RSupuran, CT Sulfonamide inhibition studies of thea-carbonic anhydrase from the gammaproteobacterium Thiomicrospira crunogena XCL-2, TcruCA. Bioorg Med Chem Lett 26:401-5 (2016)  
Target
Name:
Carbonic anhydrase
Synonyms:
4.2.1.1 | Carbonate dehydratase
Type:
PROTEIN
Mol. Mass.:
28438.71
Organism:
Sulfurihydrogenibium sp. (strain YO3AOP1)
Description:
ChEMBL_116696
Residue:
246
  
Inhibitor
Name:
BDBM50028010
Synonyms:
AD-810 CI-912 Zonegran | Zonisamide
Type:
Small organic molecule
Emp. Form.:
C8H8N2O3S
Mol. Mass.:
212.226
SMILES:
OS(=N)(=O)Cc1noc2ccccc12
: