Target
CviR transcriptional regulator
Ligand
BDBM50136221
Substrate
Meas. Tech.
ChEMBL_1547614 (CHEMBL3755484)
IC50
66080±n/a nM
Citation
 Bucio-Cano, AReyes-Arellano, ACorrea-Basurto, JBello, MTorres-Jaramillo, JSalgado-Zamora, HCuriel-Quesada, EPeralta-Cruz, JAvila-Sorrosa, A Targeting quorum sensing by designing azoline derivatives to inhibit the N-hexanoyl homoserine lactone-receptor CviR: Synthesis as well as biological and theoretical evaluations. Bioorg Med Chem 23:7565-77 (2015)  
Target
Name:
CviR transcriptional regulator
Synonyms:
Type:
PROTEIN
Mol. Mass.:
29723.76
Organism:
Chromobacterium violaceum
Description:
ChEMBL_765227
Residue:
265
  
Inhibitor
Name:
BDBM50136221
Synonyms:
CHEMBL3754734
Type:
Small organic molecule
Emp. Form.:
C17H17N3O2
Mol. Mass.:
295.3358
SMILES:
O=C(COc1ccc(cc1)C1=NCCN1)Nc1ccccc1
: