Target
Plasminogen
Ligand
BDBM50428067
Substrate
Meas. Tech.
ChEMBL_1549975 (CHEMBL3755273)
IC50
50000±n/a nM
Citation
 Hidaka, KGohda, KTeno, NWanaka, KTsuda, Y Active site-directed plasmin inhibitors: Extension on the P2 residue. Bioorg Med Chem 24:545-53 (2016)  
Target
Name:
Plasminogen
Synonyms:
Activation peptide PLG Plasmin Plasmin heavy chain A, short form | Plasmin light chain B
Type:
Enzyme
Mol. Mass.:
90579.18
Organism:
Homo sapiens (Human)
Description:
Residue:
810
  
Inhibitor
Name:
BDBM50428067
Synonyms:
CL-65336 Lysteda Trans Amcha
Type:
Small organic molecule
Emp. Form.:
C8H15NO2
Mol. Mass.:
157.2102
SMILES:
NC[C@H]1CC[C@@H](CC1)C(O)=O
: