Target
Vasopressin V1a receptor
Ligand
BDBM50139138
Substrate
Meas. Tech.
ChEMBL_1555983 (CHEMBL3767491)
IC50
>10000±n/a nM
Citation
 Jorgensen, WTGulliver, DWWerry, ELReekie, TConnor, MKassiou, M Flexible analogues of WAY-267,464: Synthesis and pharmacology at the human oxytocin and vasopressin 1a receptors. Eur J Med Chem 108:730-40 (2016)  
Target
Name:
Vasopressin V1a receptor
Synonyms:
AVPR V1a AVPR1A V1AR_HUMAN VASOPRESSIN V1A Vasopressin V1 receptor Vasopressin receptor
Type:
Receptor
Mol. Mass.:
46820.18
Organism:
Homo sapiens (Human)
Description:
P37288
Residue:
418
  
Inhibitor
Name:
BDBM50139138
Synonyms:
CHEMBL3763620
Type:
Small organic molecule
Emp. Form.:
C29H38N6O3
Mol. Mass.:
518.6504
SMILES:
COc1cc(CN2CCN(CCCCC(=O)N3Cc4cnn(C)c4Nc4ccccc34)CC2)cc(OC)c1
: