Target
DNA gyrase subunit B
Ligand
BDBM50143188
Substrate
Meas. Tech.
ChEMBL_1550878 (CHEMBL3762663)
IC50
840000±n/a nM
Citation
 Mesleh, MFCross, JBZhang, JKahmann, JAndersen, OABarker, JCheng, RKFelicetti, BWood, MHadfield, ATScheich, CMoy, TIYang, QShotwell, JNguyen, KLippa, BDolle, RRyan, MD Fragment-based discovery of DNA gyrase inhibitors targeting the ATPase subunit of GyrB. Bioorg Med Chem Lett 26:1314-8 (2016)  
Target
Name:
DNA gyrase subunit B
Synonyms:
DNA gyrase DNA gyrase subunit B (gyrB) gyrB
Type:
Enzyme Subunit
Mol. Mass.:
72530.91
Organism:
Staphylococcus aureus
Description:
Residue:
644
  
Inhibitor
Name:
BDBM50143188
Synonyms:
CHEMBL1419183
Type:
Small organic molecule
Emp. Form.:
C13H11N3O
Mol. Mass.:
225.2459
SMILES:
Cc1cc(O)[nH]c2nnc(-c3ccccc3)c12
: