Target
Carbonic anhydrase 12
Ligand
BDBM50055710
Substrate
Meas. Tech.
ChEMBL_1552967 (CHEMBL3760251)
Ki
6300±n/a nM
Citation
 Ferraroni, MCarta, FScozzafava, ASupuran, CT Thioxocoumarins Show an Alternative Carbonic Anhydrase Inhibition Mechanism Compared to Coumarins. J Med Chem 59:462-73 (2016)  
Target
Name:
Carbonic anhydrase 12
Synonyms:
CA-XII CAH12_HUMAN Carbonic anhydrase Carbonic anhydrase XII Carbonic anhydrase XII (CAXII) | Tumor antigen HOM-RCC-3.1.3
Type:
Enzyme
Mol. Mass.:
39456.00
Organism:
Homo sapiens (Human)
Description:
Catalytic domain of human cloned isozyme was used in the assay
Residue:
354
  
Inhibitor
Name:
BDBM50055710
Synonyms:
4-HYDROXY-2H-CHROMEN-2-ONE 4-hydroxycoumarin | CHEMBL301141
Type:
Small organic molecule
Emp. Form.:
C9H6O3
Mol. Mass.:
162.1421
SMILES:
Oc1cc(=O)oc2ccccc12
: