Target
Carbonic anhydrase 2
Ligand
BDBM50055710
Substrate
Meas. Tech.
ChEMBL_1552965 (CHEMBL3760249)
Ki
>100000±n/a nM
Citation
 Ferraroni, MCarta, FScozzafava, ASupuran, CT Thioxocoumarins Show an Alternative Carbonic Anhydrase Inhibition Mechanism Compared to Coumarins. J Med Chem 59:462-73 (2016)  
Target
Name:
Carbonic anhydrase 2
Synonyms:
CA-II CAC Carbonate dehydratase II Carbonic anhydrase 2 (CA-II) Carbonic anhydrase C Carbonic anhydrase II (CA-II) Carbonic anhydrase II (hCA II) | Carbonic anhydrase isoenzyme II (hCA II)
Type:
Enzyme
Mol. Mass.:
29250.71
Organism:
Homo sapiens (Human)
Description:
P00918
Residue:
260
  
Inhibitor
Name:
BDBM50055710
Synonyms:
4-HYDROXY-2H-CHROMEN-2-ONE 4-hydroxycoumarin | CHEMBL301141
Type:
Small organic molecule
Emp. Form.:
C9H6O3
Mol. Mass.:
162.1421
SMILES:
Oc1cc(=O)oc2ccccc12
: