Target
5-hydroxytryptamine receptor 2A
Ligand
BDBM50145606
Substrate
Meas. Tech.
ChEMBL_1556023 (CHEMBL3767882)
Ki
1380±n/a nM
Citation
 Fiorino, FCiano, AMagli, ESeverino, BCorvino, APerissutti, EFrecentese, FDi Vaio, PIzzo, AACapasso, RMassarelli, PNencini, CRossi, IKedzierska, EOrzelska-Gòrka, JBielenica, ASantagada, VCaliendo, G Synthesis, in vitro and in vivo pharmacological evaluation of serotoninergic ligands containing an isonicotinic nucleus. Eur J Med Chem 110:133-50 (2016)  
Target
Name:
5-hydroxytryptamine receptor 2A
Synonyms:
5-HT-2A 5-HT2A 5-hydroxytryptamine receptor 2A (5HT2A) Htr2 Serotonin Receptor 2A
Type:
G Protein-Coupled Receptor (GPCR)
Mol. Mass.:
52852.05
Organism:
Rattus norvegicus (rat)
Description:
Rat cortex membranes 5-HT2A receptors.
Residue:
471
  
Inhibitor
Name:
BDBM50145606
Synonyms:
CHEMBL3765273
Type:
Small organic molecule
Emp. Form.:
C19H23ClN4O
Mol. Mass.:
358.865
SMILES:
Clc1cccc(c1)N1CCN(CCCNC(=O)c2ccncc2)CC1
: