Target
Hepatocyte growth factor receptor
Ligand
BDBM50146167
Substrate
Meas. Tech.
ChEMBL_1555042 (CHEMBL3767620)
IC50
0.130000±n/a nM
Citation
 Zhang, JJiang, XJiang, YGuo, MZhang, SLi, JHe, JLiu, JWang, JOuyang, L Recent advances in the development of dual VEGFR and c-Met small molecule inhibitors as anticancer drugs. Eur J Med Chem 108:495-504 (2016)  
Target
Name:
Hepatocyte growth factor receptor
Synonyms:
Hepatocyte growth factor receptor Hepatocyte growth factor receptor (c-MET) MET Met proto-oncogene (hepatocyte growth factor receptor) Tyrosine-protein kinase Met (c-Met) c-Met kinase
Type:
Protein
Mol. Mass.:
155559.73
Organism:
Homo sapiens (Human)
Description:
P08581
Residue:
1390
  
Inhibitor
Name:
BDBM50146167
Synonyms:
Capmatinib INCB-28060 US10738052, Example 7 US9944645, 7
Type:
Small organic molecule
Emp. Form.:
C23H17FN6O
Mol. Mass.:
412.4191
SMILES:
CNC(=O)c1ccc(cc1F)-c1cnc2ncc(Cc3ccc4ncccc4c3)n2n1
: