Target
Adenosine receptor A1
Ligand
BDBM25400
Substrate
Meas. Tech.
ChEMBL_1556375 (CHEMBL3772106)
Ki
5.9±n/a nM
Citation
 Donegan, RKLieberman, RL Discovery of Molecular Therapeutics for Glaucoma: Challenges, Successes, and Promising Directions. J Med Chem 59:788-809 (2016)  
Target
Name:
Adenosine receptor A1
Synonyms:
A1 adenosine receptor (hA1) AA1R_HUMAN ADORA1 Adenosine A1-receptor Adenosine receptor A1 (hA1) | Adenosine transporter (AdT)
Type:
G Protein-Coupled Receptor (GPCR)
Mol. Mass.:
36520.92
Organism:
Homo sapiens (Human)
Description:
P30542
Residue:
326
  
Inhibitor
Name:
BDBM25400
Synonyms:
(2R,3R,4S,5R)-2-[6-(cyclopentylamino)-9H-purin-9-yl]-5-(hydroxymethyl)oxolane-3,4-diol CPA N6-cyclopentyladenosine (CPA) | cid_657378
Type:
Small organic molecule
Emp. Form.:
C15H21N5O4
Mol. Mass.:
335.3583
SMILES:
OC[C@H]1O[C@H]([C@H](O)[C@@H]1O)n1cnc2c(NC3CCCC3)ncnc12
: