Target
5-hydroxytryptamine receptor 2B
Ligand
BDBM50148831
Substrate
Meas. Tech.
ChEMBL_1557251 (CHEMBL3773626)
IC50
33±n/a nM
Citation
 Zhou, YMa, JLin, XHuang, XPWu, KHuang, N Structure-Based Discovery of Novel and Selective 5-Hydroxytryptamine 2B Receptor Antagonists for the Treatment of Irritable Bowel Syndrome. J Med Chem 59:707-20 (2016)  
Target
Name:
5-hydroxytryptamine receptor 2B
Synonyms:
5-HT-2B 5-hydroxytryptamine (serotonin) receptor 2B [Homo sapiens] 5-hydroxytryptamine receptor 2C (5HT2C) HTR2B Serotonin 2b (5-HT2b) receptor | Serotonin Receptor 2B
Type:
G Protein-Coupled Receptor (GPCR)
Mol. Mass.:
54312.47
Organism:
Homo sapiens (Human)
Description:
Receptor binding assays were performed using human clone stably expressed in CHO cells.
Residue:
481
  
Inhibitor
Name:
BDBM50148831
Synonyms:
CHEMBL3770342
Type:
Small organic molecule
Emp. Form.:
C14H18BrN5
Mol. Mass.:
336.23
SMILES:
NC1=NC2(CCCCC2)NC(Nc2cccc(Br)c2)=N1
: