Target
5-hydroxytryptamine receptor 2C
Ligand
BDBM50148831
Substrate
Meas. Tech.
ChEMBL_1557238 (CHEMBL3773613)
Ki
156±n/a nM
Citation
 Zhou, YMa, JLin, XHuang, XPWu, KHuang, N Structure-Based Discovery of Novel and Selective 5-Hydroxytryptamine 2B Receptor Antagonists for the Treatment of Irritable Bowel Syndrome. J Med Chem 59:707-20 (2016)  
Target
Name:
5-hydroxytryptamine receptor 2C
Synonyms:
5-HT-2C 5-HT2C-INI 5-HTR2C 5-hydroxytryptamine receptor 2C (5-HT-2C) 5HT-1C HTR1C Serotonin (5-HT3) receptor Serotonin Receptor 2C
Type:
G Protein-Coupled Receptor (GPCR)
Mol. Mass.:
51836.79
Organism:
Homo sapiens (Human)
Description:
P28335
Residue:
458
  
Inhibitor
Name:
BDBM50148831
Synonyms:
CHEMBL3770342
Type:
Small organic molecule
Emp. Form.:
C14H18BrN5
Mol. Mass.:
336.23
SMILES:
NC1=NC2(CCCCC2)NC(Nc2cccc(Br)c2)=N1
: