Target
Transient receptor potential cation channel subfamily V member 1
Ligand
BDBM26134
Substrate
Meas. Tech.
ChEMBL_1558645 (CHEMBL3771522)
IC50
9100±n/a nM
Citation
 Morera, EDi Marzo, VMonti, LAllarà, MSchiano Moriello, ANalli, MOrtar, GDe Petrocellis, L Arylboronic acids as dual-action FAAH and TRPV1 ligands. Bioorg Med Chem Lett 26:1401-5 (2016)  
Target
Name:
Transient receptor potential cation channel subfamily V member 1
Synonyms:
Capsaicin receptor Osm-9-like TRP channel 1 TRPV1_HUMAN Transient receptor potential cation channel subfamily V member 1 (TRPV1) Transient receptor potential cation channel subfamily V member 1(TRPV1) Vanilloid VR1 Vanilloid receptor 1 Vanilloid receptor 1 (VRI/TRPV1)
Type:
Protein
Mol. Mass.:
94960.75
Organism:
Homo sapiens (Human)
Description:
Q8NER1
Residue:
839
  
Inhibitor
Name:
BDBM26134
Synonyms:
(4-nonylphenyl)boranediol | Phenylboronic Acid, 13
Type:
Small organic molecule
Emp. Form.:
C15H25BO2
Mol. Mass.:
248.169
SMILES:
CCCCCCCCCc1ccc(cc1)B(O)O
: