Target
Disintegrin and metalloproteinase domain-containing protein 10
Ligand
BDBM50151246
Substrate
Meas. Tech.
ChEMBL_1559060 (CHEMBL3773916)
IC50
7000±n/a nM
Citation
 Camodeca, CNuti, ETepshi, LBoero, STuccinardi, TStura, EAPoggi, AZocchi, MRRossello, A Discovery of a new selective inhibitor of A Disintegrin And Metalloprotease 10 (ADAM-10) able to reduce the shedding of NKG2D ligands in Hodgkin's lymphoma cell models. Eur J Med Chem 111:193-201 (2016)  
Target
Name:
Disintegrin and metalloproteinase domain-containing protein 10
Synonyms:
ADA10_HUMAN Disintegrin and metalloproteinase domain-containing protein 10 (ADAM10) MADM
Type:
Enzyme
Mol. Mass.:
84160.93
Organism:
Homo sapiens (Human)
Description:
O14672
Residue:
748
  
Inhibitor
Name:
BDBM50151246
Synonyms:
CHEMBL3770935
Type:
Small organic molecule
Emp. Form.:
C16H21N5O4S2
Mol. Mass.:
411.499
SMILES:
Cc1cc(ccc1N1CCN(CC1)S(=O)(=O)N1CSC[C@@H]1C(=O)NO)C#N
: