Target
Matrix metalloproteinase-9
Ligand
BDBM50151246
Substrate
Meas. Tech.
ChEMBL_1559054 (CHEMBL3773751)
IC50
24000±n/a nM
Citation
 Camodeca, CNuti, ETepshi, LBoero, STuccinardi, TStura, EAPoggi, AZocchi, MRRossello, A Discovery of a new selective inhibitor of A Disintegrin And Metalloprotease 10 (ADAM-10) able to reduce the shedding of NKG2D ligands in Hodgkin's lymphoma cell models. Eur J Med Chem 111:193-201 (2016)  
Target
Name:
Matrix metalloproteinase-9
Synonyms:
67 kDa matrix metalloproteinase-9 92 kDa gelatinase CLG4B Gelatinase B MMP9 Matrix metalloproteinase 9 (MMP-9) Matrix metalloproteinase-9 (MMP9)
Type:
Enzyme
Mol. Mass.:
78452.28
Organism:
Homo sapiens (Human)
Description:
P14780
Residue:
707
  
Inhibitor
Name:
BDBM50151246
Synonyms:
CHEMBL3770935
Type:
Small organic molecule
Emp. Form.:
C16H21N5O4S2
Mol. Mass.:
411.499
SMILES:
Cc1cc(ccc1N1CCN(CC1)S(=O)(=O)N1CSC[C@@H]1C(=O)NO)C#N
: