Target
Matrix metalloproteinase-14
Ligand
BDBM50151246
Substrate
Meas. Tech.
ChEMBL_1559051 (CHEMBL3773748)
IC50
100000±n/a nM
Citation
 Camodeca, CNuti, ETepshi, LBoero, STuccinardi, TStura, EAPoggi, AZocchi, MRRossello, A Discovery of a new selective inhibitor of A Disintegrin And Metalloprotease 10 (ADAM-10) able to reduce the shedding of NKG2D ligands in Hodgkin's lymphoma cell models. Eur J Med Chem 111:193-201 (2016)  
Target
Name:
Matrix metalloproteinase-14
Synonyms:
MMP-14 MMP14 MT-MMP 1 MT1MMP Matrix Metalloproteinase-14 (MMP-14) Matrix metalloproteinase-14 Membrane-type matrix metalloproteinase 1 | Membrane-type-1 matrix metalloproteinase
Type:
Protein
Mol. Mass.:
65900.19
Organism:
Homo sapiens (Human)
Description:
P50281
Residue:
582
  
Inhibitor
Name:
BDBM50151246
Synonyms:
CHEMBL3770935
Type:
Small organic molecule
Emp. Form.:
C16H21N5O4S2
Mol. Mass.:
411.499
SMILES:
Cc1cc(ccc1N1CCN(CC1)S(=O)(=O)N1CSC[C@@H]1C(=O)NO)C#N
: