Target
Type-2 angiotensin II receptor
Ligand
BDBM50049195
Substrate
Meas. Tech.
ChEMBL_1560582 (CHEMBL3777314)
Ki
1.5±n/a nM
Citation
 Dosa, PIAmin, EA Tactical Approaches to Interconverting GPCR Agonists and Antagonists. J Med Chem 59:810-40 (2016)  
Target
Name:
Type-2 angiotensin II receptor
Synonyms:
AGTR2 AT2 Angiotensin II type 2 (AT-2) receptor Type-2 angiotensin II receptor
Type:
Enzyme Catalytic Domain
Mol. Mass.:
41201.61
Organism:
Homo sapiens (Human)
Description:
Angiotensin II, central 0 0::P50052
Residue:
363
  
Inhibitor
Name:
BDBM50049195
Synonyms:
3-[(2'-(butylsulfonylcarbamate)-3'-propyl-1,1'-biphenyl-4-yl)methyl]-2-ethyl-5,7-dimethyl-3H-imidazo[4,5-b]pyridine CHEMBL39959 N-Butyloxycarbonyl-4'-(2-Ethyl-5,7-dimethyl-imidazo[4,5-b]pyridin-3-ylmethyl)-5-propyl-biphenyl-2-sulfonic acid amide
Type:
Small organic molecule
Emp. Form.:
C31H38N4O4S
Mol. Mass.:
562.723
SMILES:
CCCCOC(=O)NS(=O)(=O)c1ccc(CCC)cc1-c1ccc(Cn2c(CC)nc3c(C)cc(C)nc23)cc1
: