Target
ALK tyrosine kinase receptor
Ligand
BDBM50157318
Substrate
Meas. Tech.
ChEMBL_1568144 (CHEMBL3791603)
IC50
34±n/a nM
Citation
 Song, DLee, MPark, CHAhn, SYun, CSLee, COKim, HRHwang, JY Novel 2,4-diaminopyrimidines bearing tetrahydronaphthalenyl moiety against anaplastic lymphoma kinase (ALK): Synthesis, in vitro, ex vivo, and in vivo efficacy studies. Bioorg Med Chem Lett 26:1720-5 (2016)  
Target
Name:
ALK tyrosine kinase receptor
Synonyms:
ALK ALK_HUMAN CD_antigen: CD246
Type:
Protein
Mol. Mass.:
176453.10
Organism:
Homo sapiens (Human)
Description:
Q9UM73
Residue:
1620
  
Inhibitor
Name:
BDBM50157318
Synonyms:
CHEMBL3785322
Type:
Small organic molecule
Emp. Form.:
C26H31ClN4O4S
Mol. Mass.:
531.067
SMILES:
COc1cc2CCC(O)C(C)(C)c2cc1Nc1ncc(Cl)c(Nc2ccccc2S(=O)(=O)C(C)C)n1
: