Target
ALK tyrosine kinase receptor
Ligand
BDBM50157538
Substrate
Meas. Tech.
ChEMBL_1568145 (CHEMBL3791604)
IC50
3.6±n/a nM
Citation
 Song, DLee, MPark, CHAhn, SYun, CSLee, COKim, HRHwang, JY Novel 2,4-diaminopyrimidines bearing tetrahydronaphthalenyl moiety against anaplastic lymphoma kinase (ALK): Synthesis, in vitro, ex vivo, and in vivo efficacy studies. Bioorg Med Chem Lett 26:1720-5 (2016)  
Target
Name:
ALK tyrosine kinase receptor
Synonyms:
ALK ALK_HUMAN CD_antigen: CD246
Type:
Protein
Mol. Mass.:
176453.10
Organism:
Homo sapiens (Human)
Description:
Q9UM73
Residue:
1620
  
Inhibitor
Name:
BDBM50157538
Synonyms:
CHEMBL3785299
Type:
Small organic molecule
Emp. Form.:
C30H39ClN6O4S
Mol. Mass.:
615.186
SMILES:
COc1cc2c(CCC(NC(=O)CN(C)C)C2(C)C)cc1Nc1ncc(Cl)c(Nc2ccccc2S(=O)(=O)C(C)C)n1
: