Target
Lysine-specific histone demethylase 1A
Ligand
BDBM50158883
Substrate
Meas. Tech.
ChEMBL_1566028 (CHEMBL3791186)
Ki
240±n/a nM
Citation
 McAllister, TEEngland, KSHopkinson, RJBrennan, PEKawamura, ASchofield, CJ Recent Progress in Histone Demethylase Inhibitors. J Med Chem 59:1308-29 (2016)  
Target
Name:
Lysine-specific histone demethylase 1A
Synonyms:
AOF2 Flavin-containing amine oxidase domain-containing protein 2 KDM1A KIAA0601 Lysine-specific demethylase 1 (LSD1) Lysine-specific histone demethylase 1 (LSD1)
Type:
Enzyme
Mol. Mass.:
92901.01
Organism:
Homo sapiens (Human)
Description:
O60341
Residue:
852
  
Inhibitor
Name:
BDBM50158883
Synonyms:
CHEMBL3785964
Type:
Small organic molecule
Emp. Form.:
C106H182N36O25
Mol. Mass.:
2360.8055
SMILES:
CC(C)C[C@H](NC(=O)[C@H](Cc1ccccc1)NC(=O)CNC(=O)[C@H](CCCNC(N)=N)NC(=O)[C@@H]1CCCN1)C(=O)N[C@@H](C(C)C)C(=O)N[C@@H](CCCCN)C(=O)N[C@@H](CCCNC(N)=N)C(=O)N[C@@H](CO)C(=O)N[C@@H](CCCCN)C(=O)N[C@@H](CCCCN)C(=O)N[C@@H](CO)C(=O)N[C@@H]([C@@H](C)O)C(=O)N1CCC[C@H]1C(=O)N[C@@H](C(C)C)C(=O)N[C@@H](CO)C(=O)N[C@@H](Cc1ccc(O)cc1)C(=O)N[C@@H](CCCNC(N)=N)C(=O)N[C@@H](C(C)C)C(=O)N[C@@H](CCCNC(N)=N)C(N)=O
: