Target
Corticotropin-releasing factor receptor 1
Ligand
BDBM50161925
Substrate
Meas. Tech.
ChEMBL_1572346 (CHEMBL3795929)
IC50
>10000±n/a nM
Citation
 Mochizuki, MKori, MKobayashi, KYano, TSako, YTanaka, MKanzaki, NGyorkos, ACCorrette, CPCho, SYPratt, SAAso, K Design and Synthesis of Benzimidazoles As Novel Corticotropin-Releasing Factor 1 Receptor Antagonists. J Med Chem 59:2551-66 (2016)  
Target
Name:
Corticotropin-releasing factor receptor 1
Synonyms:
CRF-R CRF1 CRFR1 CRH-R 1 CRHR1 Corticotropin-releasing factor receptor 1 (CRF-1) Corticotropin-releasing hormone receptor 1
Type:
Enzyme
Mol. Mass.:
50744.31
Organism:
Homo sapiens (Human)
Description:
P34998
Residue:
444
  
Inhibitor
Name:
BDBM50161925
Synonyms:
CHEMBL3793159
Type:
Small organic molecule
Emp. Form.:
C26H29ClN4O
Mol. Mass.:
448.988
SMILES:
CCN(CC)c1ccc(-c2ccccc2)c2nc(Nc3c(C)cc(Cl)cc3OC)n(C)c12
: