Target
Carbonic anhydrase 12
Ligand
BDBM50380140
Substrate
Meas. Tech.
ChEMBL_1572878 (CHEMBL3801014)
Kd
180±n/a nM
Citation
 Talibov, VOLinkuviene, VMatulis, DDanielson, UH Kinetically Selective Inhibitors of Human Carbonic Anhydrase Isozymes I, II, VII, IX, XII, and XIII. J Med Chem 59:2083-93 (2016)  
Target
Name:
Carbonic anhydrase 12
Synonyms:
CA-XII CAH12_HUMAN Carbonic anhydrase Carbonic anhydrase XII Carbonic anhydrase XII (CAXII) | Tumor antigen HOM-RCC-3.1.3
Type:
Enzyme
Mol. Mass.:
39456.00
Organism:
Homo sapiens (Human)
Description:
Catalytic domain of human cloned isozyme was used in the assay
Residue:
354
  
Inhibitor
Name:
BDBM50380140
Synonyms:
CHEMBL2011155 | carbonic anhydrase (CA) inhibitors, benzenesulphonamide ligand, 10
Type:
Small organic molecule
Emp. Form.:
C12H10ClN3O3S2
Mol. Mass.:
343.809
SMILES:
NS(=O)(=O)c1cc(ccc1Cl)C(=O)CSc1ncccn1
: