Target
Carbonic anhydrase 7
Ligand
BDBM50380140
Substrate
Meas. Tech.
ChEMBL_1572870 (CHEMBL3801006)
Kd
370±n/a nM
Citation
 Talibov, VOLinkuviene, VMatulis, DDanielson, UH Kinetically Selective Inhibitors of Human Carbonic Anhydrase Isozymes I, II, VII, IX, XII, and XIII. J Med Chem 59:2083-93 (2016)  
Target
Name:
Carbonic anhydrase 7
Synonyms:
CA-VII CAH7_HUMAN Carbonic anhydrase Carbonic anhydrase VII (CA VII)
Type:
Enzyme
Mol. Mass.:
29664.11
Organism:
Homo sapiens (Human)
Description:
Human cloned isozyme.
Residue:
264
  
Inhibitor
Name:
BDBM50380140
Synonyms:
CHEMBL2011155 | carbonic anhydrase (CA) inhibitors, benzenesulphonamide ligand, 10
Type:
Small organic molecule
Emp. Form.:
C12H10ClN3O3S2
Mol. Mass.:
343.809
SMILES:
NS(=O)(=O)c1cc(ccc1Cl)C(=O)CSc1ncccn1
: