Target
Carbonic anhydrase 13
Ligand
BDBM50163865
Substrate
Meas. Tech.
ChEMBL_1572883 (CHEMBL3801019)
Kd
0.42±n/a nM
Citation
 Talibov, VOLinkuviene, VMatulis, DDanielson, UH Kinetically Selective Inhibitors of Human Carbonic Anhydrase Isozymes I, II, VII, IX, XII, and XIII. J Med Chem 59:2083-93 (2016)  
Target
Name:
Carbonic anhydrase 13
Synonyms:
CA13 Carbonic anhydrase Carbonic anhydrase XIII (CA XIII)
Type:
Enzyme
Mol. Mass.:
29445.78
Organism:
Homo sapiens (Human)
Description:
Q8N1Q1
Residue:
262
  
Inhibitor
Name:
BDBM50163865
Synonyms:
CHEMBL3799577 | carbonic anhydrase (CA) inhibitors, benzenesulphonamide ligand, 14
Type:
Small organic molecule
Emp. Form.:
C15H15F3N2O4S2
Mol. Mass.:
408.416
SMILES:
CNc1c(F)c(c(F)c(F)c1S(=O)(=O)CCc1ccccc1)S(N)(=O)=O
: