Target
Carbonic anhydrase 2
Ligand
BDBM50163863
Substrate
Meas. Tech.
ChEMBL_1572867 (CHEMBL3801003)
Kd
3.3±n/a nM
Citation
 Talibov, VOLinkuviene, VMatulis, DDanielson, UH Kinetically Selective Inhibitors of Human Carbonic Anhydrase Isozymes I, II, VII, IX, XII, and XIII. J Med Chem 59:2083-93 (2016)  
Target
Name:
Carbonic anhydrase 2
Synonyms:
CA-II CAC Carbonate dehydratase II Carbonic anhydrase 2 (CA-II) Carbonic anhydrase C Carbonic anhydrase II (CA-II) Carbonic anhydrase II (hCA II) | Carbonic anhydrase isoenzyme II (hCA II)
Type:
Enzyme
Mol. Mass.:
29250.71
Organism:
Homo sapiens (Human)
Description:
P00918
Residue:
260
  
Inhibitor
Name:
BDBM50163863
Synonyms:
4-(1H-benzimidazol-1-ylacetyl)-2-chlorobenzenesulfonamide (2a) carbonic anhydrase (CA) inhibitors, benzenesulphonamide ligand, 2
Type:
Small organic molecule
Emp. Form.:
C15H12ClN3O3S
Mol. Mass.:
349.792
SMILES:
NS(=O)(=O)c1ccc(cc1Cl)C(=O)Cn1cnc2ccccc12
: