Target
Carbonic anhydrase 9
Ligand
BDBM50163861
Substrate
Meas. Tech.
ChEMBL_1572874 (CHEMBL3801010)
Kd
150±n/a nM
Citation
 Talibov, VOLinkuviene, VMatulis, DDanielson, UH Kinetically Selective Inhibitors of Human Carbonic Anhydrase Isozymes I, II, VII, IX, XII, and XIII. J Med Chem 59:2083-93 (2016)  
Target
Name:
Carbonic anhydrase 9
Synonyms:
CA-IX CAH9_HUMAN Carbonic anhydrase 9 (CA IX) Carbonic anhydrase 9 precursor Carbonic anhydrase IX (CAIX) Carbonic anhydrases; II & IX MN RCC-associated antigen G250
Type:
Enzyme
Mol. Mass.:
49669.03
Organism:
Homo sapiens (Human)
Description:
Catalytic domain of human cloned isozyme was used in the assay
Residue:
459
  
Inhibitor
Name:
BDBM50163861
Synonyms:
CHEMBL3799945 | carbonic anhydrase (CA) inhibitors, benzenesulphonamide ligand, 15
Type:
Small organic molecule
Emp. Form.:
C14H12F4N2O3S
Mol. Mass.:
364.315
SMILES:
COc1ccc(CNc2c(F)c(F)c(F)c(F)c2S(N)(=O)=O)cc1
: