Target
Cysteinyl leukotriene receptor 1
Ligand
BDBM50172348
Substrate
Meas. Tech.
ChEBML_1579540
IC50
9.0±n/a nM
Citation
 Chen, HYang, HWang, ZXie, XNan, F Discovery of 3-Substituted 1H-Indole-2-carboxylic Acid Derivatives as a Novel Class of CysLT1 Selective Antagonists. ACS Med Chem Lett 7:335-9 (2016)  
Target
Name:
Cysteinyl leukotriene receptor 1
Synonyms:
CLTR1_HUMAN CYSLTR1 Cysteinyl leukotriene receptor HG55 LTD4 receptor | Leukotriene Cysteinyl 1
Type:
Enzyme Catalytic Domain
Mol. Mass.:
38565.16
Organism:
Homo sapiens (Human)
Description:
Leukotriene Cysteinyl 1 CYSLTR1 HUMAN::Q9Y271
Residue:
337
  
Inhibitor
Name:
BDBM50172348
Synonyms:
CHEMBL3809230
Type:
Small organic molecule
Emp. Form.:
C29H20ClN3O3
Mol. Mass.:
493.94
SMILES:
OC(=O)c1[nH]c2ccccc2c1\C=C\C(=O)Nc1cccc(\C=C\c2ccc3ccc(Cl)cc3n2)c1
: