Target
Aminopeptidase B
Ligand
BDBM50010157
Substrate
Meas. Tech.
ChEMBL_1580949 (CHEMBL3812617)
IC50
3500±n/a nM
Citation
 Gunaydin, HBartberger, MD Stacking with No Planarity? ACS Med Chem Lett 7:341-4 (2016)  
Target
Name:
Aminopeptidase B
Synonyms:
AMPB_HUMAN Aminopeptidase Arginine aminopeptidase RNPEP
Type:
PROTEIN
Mol. Mass.:
72586.33
Organism:
Homo sapiens (Human)
Description:
ChEMBL_36048
Residue:
650
  
Inhibitor
Name:
BDBM50010157
Synonyms:
CHEMBL3251698
Type:
Small organic molecule
Emp. Form.:
C16H30N2O4
Mol. Mass.:
314.4204
SMILES:
CC(C)C[C@H](NC(=O)[C@@H](O)[C@H](N)CC1CCCCC1)C(O)=O
: