Target
Carbonic anhydrase 9
Ligand
BDBM50176458
Substrate
Meas. Tech.
ChEMBL_1579081 (CHEMBL3811429)
Ki
6.7±n/a nM
Citation
 Abdel Gawad, NMAmin, NHElsaadi, MTMohamed, FMMAngeli, ADe Luca, VCapasso, CSupuran, CT Synthesis of 4-(thiazol-2-ylamino)-benzenesulfonamides with carbonic anhydrase I, II and IX inhibitory activity and cytotoxic effects against breast cancer cell lines. Bioorg Med Chem 24:3043-3051 (2016)  
Target
Name:
Carbonic anhydrase 9
Synonyms:
CA-IX CAH9_HUMAN Carbonic anhydrase 9 (CA IX) Carbonic anhydrase 9 precursor Carbonic anhydrase IX (CAIX) Carbonic anhydrases; II & IX MN RCC-associated antigen G250
Type:
Enzyme
Mol. Mass.:
49669.03
Organism:
Homo sapiens (Human)
Description:
Catalytic domain of human cloned isozyme was used in the assay
Residue:
459
  
Inhibitor
Name:
BDBM50176458
Synonyms:
CHEMBL3809959
Type:
Small organic molecule
Emp. Form.:
C14H18N4O2S2
Mol. Mass.:
338.448
SMILES:
NS(=O)(=O)c1ccc(Nc2nc(cs2)N2CCCCC2)cc1
: