Target
Carbonic anhydrase 2
Ligand
BDBM50176697
Substrate
Meas. Tech.
ChEMBL_1579080 (CHEMBL3811428)
Ki
0.530000±n/a nM
Citation
 Abdel Gawad, NMAmin, NHElsaadi, MTMohamed, FMMAngeli, ADe Luca, VCapasso, CSupuran, CT Synthesis of 4-(thiazol-2-ylamino)-benzenesulfonamides with carbonic anhydrase I, II and IX inhibitory activity and cytotoxic effects against breast cancer cell lines. Bioorg Med Chem 24:3043-3051 (2016)  
Target
Name:
Carbonic anhydrase 2
Synonyms:
CA-II CAC Carbonate dehydratase II Carbonic anhydrase 2 (CA-II) Carbonic anhydrase C Carbonic anhydrase II (CA-II) Carbonic anhydrase II (hCA II) | Carbonic anhydrase isoenzyme II (hCA II)
Type:
Enzyme
Mol. Mass.:
29250.71
Organism:
Homo sapiens (Human)
Description:
P00918
Residue:
260
  
Inhibitor
Name:
BDBM50176697
Synonyms:
CHEMBL3809123
Type:
Small organic molecule
Emp. Form.:
C16H16N8O5S3
Mol. Mass.:
496.544
SMILES:
[#7]\[#6](-[#7])=[#7]\S(=O)(=O)c1ccc(-[#7]\[#7]=[#6]-2/[#16]-[#6](-[#7]-c3ccc(cc3)S([#7])(=O)=O)=[#7]-[#6]-2=O)cc1
: