Target
Oxysterols receptor LXR-alpha/LXR-beta
Ligand
BDBM50177015
Substrate
Meas. Tech.
ChEMBL_1582631 (CHEMBL3817039)
EC50
6.0±n/a nM
Citation
 Zheng, YZhuang, LFan, KYTice, CMZhao, WDong, CLotesta, SDLeftheris, KLindblom, PRLiu, ZShimada, JNoto, PBMeng, SHardy, AHoward, LKrosky, PGuo, JLipinski, KKandpal, GBukhtiyarov, YZhao, YLala, DVan Orden, RZhou, JChen, GWu, ZMcKeever, BMMcGeehan, GMGregg, REClaremon, DASingh, SB Discovery of a Novel, Orally Efficacious Liver X Receptor (LXR)ß Agonist. J Med Chem 59:3264-71 (2016)  
Target
Name:
Oxysterols receptor LXR-alpha/LXR-beta
Synonyms:
Liver X receptor
Type:
Mol. Mass.:
Description:
ASSAY_ID of ChEMBL is 1519735
Components:
This complex has 2 components.
Component 1
Name:
Oxysterols receptor LXR-beta
Synonyms:
LXRB Liver X, LXR beta NR1H2 Nuclear receptor NER Ubiquitously-expressed nuclear receptor
Type:
Enzyme Catalytic Domain
Mol. Mass.:
50978.79
Organism:
Homo sapiens (Human)
Description:
P55055
Residue:
460
  
Component 2
Name:
Oxysterols receptor LXR-alpha
Synonyms:
LXRA Liver X receptor alpha Liver X receptor alpha (NR1H3) NR1H3 Nuclear orphan receptor LXR-alpha | Nuclear receptor subfamily 1 group H member 3
Type:
Enzyme Catalytic Domain
Mol. Mass.:
50403.85
Organism:
Homo sapiens (Human)
Description:
Q13133
Residue:
447
  
Inhibitor
Name:
BDBM50177015
Synonyms:
CHEMBL3814206 | US10144715, Compound 19-1
Type:
Small organic molecule
Emp. Form.:
C21H27F3N4O4S
Mol. Mass.:
488.524
SMILES:
CC(C)[C@@H]1CN(CCN1c1ncc(CO)c(n1)C(F)(F)F)c1ccc(CO)c(c1)S(C)(=O)=O
: