Target
Phosphatidylinositol 4,5-bisphosphate 3-kinase catalytic subunit gamma isoform
Ligand
BDBM50178287
Substrate
Meas. Tech.
ChEMBL_1583672 (CHEMBL3815759)
IC50
>10000±n/a nM
Citation
 Wucherer-Plietker, MMerkul, EMüller, TJEsdar, CKnöchel, THeinrich, TBuchstaller, HPGreiner, HDorsch, DFinsinger, DCalderini, MBruge, DGrädler, U Discovery of novel 7-azaindoles as PDK1 inhibitors. Bioorg Med Chem Lett 26:3073-80 (2016)  
Target
Name:
Phosphatidylinositol 4,5-bisphosphate 3-kinase catalytic subunit gamma isoform
Synonyms:
PI3-kinase p110 subunit gamma PI3Kgamma PK3CG_HUMAN Phosphatidylinositol 4,5-bisphosphate 3-kinase (PI3K) Phosphatidylinositol 4,5-bisphosphate 3-kinase catalytic subunit gamma (PI3Kgamma) Phosphatidylinositol 4,5-bisphosphate 3-kinase catalytic subunit gamma isoform (PI3K) Phosphatidylinositol-4,5-bisphosphate 3-kinase catalytic subunit gamma isoform Phosphoinositide 3-kinases gamma (PI3K gamma) p120-PI3K
Type:
Enzyme Subunit
Mol. Mass.:
126470.30
Organism:
Homo sapiens (Human)
Description:
P48736
Residue:
1102
  
Inhibitor
Name:
BDBM50178287
Synonyms:
CHEMBL3814785
Type:
Small organic molecule
Emp. Form.:
C17H17N7
Mol. Mass.:
319.3638
SMILES:
CCc1cc(nc(N)n1)-c1c[nH]c2ncc(cc12)-c1cnn(C)c1
: