Target
3-phosphoinositide-dependent protein kinase 1
Ligand
BDBM50178298
Substrate
Meas. Tech.
ChEMBL_1583663 (CHEMBL3815750)
IC50
1100±n/a nM
Citation
 Wucherer-Plietker, MMerkul, EMüller, TJEsdar, CKnöchel, THeinrich, TBuchstaller, HPGreiner, HDorsch, DFinsinger, DCalderini, MBruge, DGrädler, U Discovery of novel 7-azaindoles as PDK1 inhibitors. Bioorg Med Chem Lett 26:3073-80 (2016)  
Target
Name:
3-phosphoinositide-dependent protein kinase 1
Synonyms:
3-Phosphoinositide-Dependent Protein Kinase 1 (PDK1) 3-phosphoinositide-dependent protein kinase 1 3-phosphoinositide-dependent protein kinase 1 (PDK-1) Isoform 2 of 3-phosphoinositide-dependent protein kinase 1 PDPK1 Phosphoinositide-dependent protein kinase 1 (PDK1) hPDK1
Type:
Enzyme
Mol. Mass.:
63157.65
Organism:
Homo sapiens (Human)
Description:
O15530
Residue:
556
  
Inhibitor
Name:
BDBM50178298
Synonyms:
CHEMBL3799935
Type:
Small organic molecule
Emp. Form.:
C18H14N4
Mol. Mass.:
286.3306
SMILES:
Nc1ncc(cc1-c1nc2ccccc2[nH]1)-c1ccccc1
: