Target
Alpha-2A adrenergic receptor
Ligand
BDBM50179383
Substrate
Meas. Tech.
ChEMBL_1583766 (CHEMBL3815853)
Ki
62000±n/a nM
Citation
 Vucicevic, JSrdic-Rajic, TPieroni, MLaurila, JMPerovic, VTassini, SAzzali, ECostantino, GGlisic, SAgbaba, DScheinin, MNikolic, KRadi, MVeljkovic, N A combined ligand- and structure-based approach for the identification of rilmenidine-derived compounds which synergize the antitumor effects of doxorubicin. Bioorg Med Chem 24:3174-83 (2016)  
Target
Name:
Alpha-2A adrenergic receptor
Synonyms:
ADA2A_HUMAN ADRA2R Adrenergic alpha2A Alpha-2 adrenergic receptor subtype C10 Alpha-2A adrenoreceptor alpha-2A adrenergic receptor [Homo sapiens]
Type:
Enzyme
Mol. Mass.:
48979.91
Organism:
Homo sapiens (Human)
Description:
P08913
Residue:
450
  
Inhibitor
Name:
BDBM50179383
Synonyms:
CHEMBL3814593
Type:
Small organic molecule
Emp. Form.:
C16H28N2O
Mol. Mass.:
264.4063
SMILES:
CCCCCNc1cc(C)n(CCCCC)c(=O)c1
: