Target
Nischarin
Ligand
BDBM50179398
Substrate
Meas. Tech.
ChEMBL_1583798 (CHEMBL3815885)
Ki
347±n/a nM
Citation
 Vucicevic, JSrdic-Rajic, TPieroni, MLaurila, JMPerovic, VTassini, SAzzali, ECostantino, GGlisic, SAgbaba, DScheinin, MNikolic, KRadi, MVeljkovic, N A combined ligand- and structure-based approach for the identification of rilmenidine-derived compounds which synergize the antitumor effects of doxorubicin. Bioorg Med Chem 24:3174-83 (2016)  
Target
Name:
Nischarin
Synonyms:
Imidazoline I1 Nisch | Nischarin
Type:
Enzyme Catalytic Domain
Mol. Mass.:
166460.59
Organism:
RAT
Description:
Q4G017
Residue:
1502
  
Inhibitor
Name:
BDBM50179398
Synonyms:
CHEMBL94022
Type:
Small organic molecule
Emp. Form.:
C12H14N2
Mol. Mass.:
186.253
SMILES:
[H][C@@]1(C[C@]1([H])c1ccccc1)C1=NCCN1
: