Target
Free fatty acid receptor 1
Ligand
BDBM50343141
Substrate
Meas. Tech.
ChEMBL_1585168 (CHEMBL3820976)
Ki
5.9±n/a nM
Citation
 Christiansen, EHudson, BDHansen, AHMilligan, GUlven, T Development and Characterization of a Potent Free Fatty Acid Receptor 1 (FFA1) Fluorescent Tracer. J Med Chem 59:4849-58 (2016)  
Target
Name:
Free fatty acid receptor 1
Synonyms:
FFAR1 G-protein Coupled Receptor 40 | GPR40
Type:
G Protein-Coupled Receptor (GPCR)
Mol. Mass.:
31473.32
Organism:
Homo sapiens (Human)
Description:
O14842
Residue:
300
  
Inhibitor
Name:
BDBM50343141
Synonyms:
3-(4(2'-Methylbiphenyl-3-ylmethylamino)phenyl)propanoic acid | CHEMBL1773261
Type:
Small organic molecule
Emp. Form.:
C23H23NO2
Mol. Mass.:
345.4342
SMILES:
Cc1ccccc1-c1cccc(CNc2ccc(CCC(O)=O)cc2)c1
: